Allmänbegrepp
type: Class
label: Oktasašdoaba @se
label: Yleiskäsite @fi
label: General concept @en

ALLFO - Allmän finländsk ontologi
type: Ontology
type: ConceptScheme
label: YSO - Almmolaš suopmelaš ontologiija @sme
label: YSO - Yleinen suomalainen ontologia @fi
label: YSO - General Finnish ontology @en

89 Musik
type: ConceptGroup
type: Collection
member: inkamusik
preferred label: 89 Musihkka @se
preferred label: 89 Musiikki @fi
preferred label: 89 Music @en

inkamusik
type: Allmänbegrepp
type: Concept
created: 1996-02-08
modified: 2020-10-09
alternative label: pan flute music (world music) @en
broader: underhållningsmusik
definition: Musikart som uppkommit främst i Anderna som en sammansmältning av sydamerikanska indianers och spanjorers traditionella musik. Typiska instrument i inkamusik är olika panflöjter, gitarrer och harpor. Inkamusik är till sin stil ofta en blandning av populär- och traditionell musik.
definition: Etelä-Amerikan intiaanien ja espanjalaisten perinnemusiikkien sulautumana syntynyt musiikin laji etupäässä Andien alueella. Inkamusiikille tyypillisiä soittimia ovat erilaiset panhuilut, kitarat ja harput. Inkamusiikki on tyylillisesti usein populaari- ja perinnemusiikin sekoitusta. @fi
in scheme: ALLFO - Allmän finländsk ontologi
preferred label: panpipe music (world music) @en
preferred label: inkamusiikki @fi
related: världsmusik
scope note: Käsitettä suositellaan käytettäväksi aina, kun kyseessä ei ole selkeästi intiaanien oma perinnemusiikki, jota esiintyy samoilla alueilla kuin inkamusiikkiakin. @fi
scope note: Begreppet används då det inte tydligt är frågan om indianernas egna traditionella musik som också förekommer på samma områden som inkamusik.

världsmusik
type: Concept
type: Allmänbegrepp
preferred label: máilmmimusihkka @se
preferred label: maailmanmusiikki @fi
preferred label: world music @en
related: inkamusik

underhållningsmusik
type: Concept
type: Allmänbegrepp
narrower: inkamusik
preferred label: ájanasmusihkka @se
preferred label: viihdemusiikki @fi
preferred label: light music @en