Yleiskäsite
type: Class
label: Allmänbegrepp @sv
label: Oktasašdoaba @se
label: General concept @en

YSO - Yleinen suomalainen ontologia
type: Ontology
type: ConceptScheme
label: YSO - Almmolaš suopmelaš ontologiija @sme
label: ALLFO - Allmän finländsk ontologi @sv
label: YSO - General Finnish ontology @en

taustamusiikki
type: Yleiskäsite
type: Concept
created: 1987-01-01
modified: 2023-02-08
alternative label: muzak
broader: musiikki
definition: Musik som spelas i köpcentrum, på arbetsplatser, flygplatser e.d offentliga platser, och vars syfte är att främja en önskad sinnesstämning eller stämning. Bakgrundsmusik är vanligen statisk, upprepande och jämt harmonisk, så att man inte ägnar den någon medveten uppmärksamhet. @sv
definition: Liikekeskuksissa, työpaikoilla, lentokentillä yms. julkisissa tiloissa soitettava musiikki, jonka tarkoituksena on usein edistää haluttua mielialaa tai tunnelmaa (esim. ostohalukkuus, tarmokkuus työssä, rauhallisuus tms.). Taustamusiikki on yleensä staattista, toisteista ja tasaisen harmonista, joten siihen ei kiinnitetä tietoista huomiota.
in scheme: YSO - Yleinen suomalainen ontologia
preferred label: background music @en
preferred label: bakgrundsmusik @sv
preferred label: duogášmusihkka @se
related: tuotantomusiikki
related: äänimaisemateokset
related: aistimarkkinointi
scope note: Begreppet används endast i denna betydelse. Termen "muzak" som också är vanlig används inte, eftersom det är ett registrerat varumärke. @sv
scope note: Käsitettä käytetään vain tässä merkityksessä. Arkikielessä yleistä termiä "muzak" ei käytetä, koska se on tavaramerkillä suojattu kaupallinen termi.

musiikki
type: Concept
type: Yleiskäsite
narrower: taustamusiikki
preferred label: musihkka @se
preferred label: music @en
preferred label: musik @sv

musiikki tarkoituksen mukaan
type: ThesaurusArray
type: Collection
member: taustamusiikki
preferred label: musihkka ulbmila mielde @se
preferred label: musik enligt funktion @sv
preferred label: music by purpose @en

89 Musiikki
type: ConceptGroup
type: Collection
member: taustamusiikki
preferred label: 89 Musihkka @se
preferred label: 89 Musik @sv
preferred label: 89 Music @en

tuotantomusiikki
type: Concept
type: Yleiskäsite
preferred label: produktionsmusik @sv
preferred label: production music @en
related: taustamusiikki

aistimarkkinointi
type: Concept
type: Yleiskäsite
preferred label: áicomárkanastin @se
preferred label: sinnesmarknadsföring @sv
preferred label: sensory marketing @en
related: taustamusiikki

äänimaisemateokset
type: Concept
type: Yleiskäsite
preferred label: soundscapeverk @sv
preferred label: soundscape works @en
related: taustamusiikki