huilusoittimet
type: Concept
narrower: okariina

okariina
type: Concept
created: 1996-02-07
modified: 2017-09-06T13:39:23+03:00
broader: huilusoittimet
definition: Useimmiten savesta valmistettu astiahuilu.
in scheme: ysa

89 Musiikki
type: Collection
member: okariina