laulut
type: Concept
narrower: merimieslaulut

merimieslaulut
type: Concept
created: 1996-10-17
modified: 2017-09-19T16:09:33+03:00
alternative label: shanties
broader: laulut
definition: Populaarimusiikkiin kuuluvia lauluja, jotka tekstinsä takia liittyvät merimiesammatin perinteisiin.
in scheme: ysa

89 Musiikki
type: Collection
member: merimieslaulut