bebop
type: Concept
narrower: afrokuubalainen jazz

afrokuubalainen jazz
type: Concept
created: 1996-02-07
modified: 2017-09-07T15:16:15+03:00
broader: bebop
definition: 1940-luvun lopulla bebopiin ja kuubalaiseen populaarimusiikkiin pohjautuva, yleensä suurella yhtyeellä tai orkesterilla (big band) esitetty jazzin laji.
in scheme: ysa

89 Musiikki
type: Collection
member: afrokuubalainen jazz