lyömäsoittimet
type: Concept
narrower: rummut

rummut
type: Concept
created: 1987-01-01
modified: 2019-01-07T15:40:16+02:00
broader: lyömäsoittimet
definition: Lyömäsoitin, jossa on kehyksen yli pingotettu kalvo.
in scheme: ysa
narrower: tabla

tabla
type: Concept
broader: rummut

89 Musiikki
type: Collection
member: rummut