luuttu
type: Concept
created: 1987-01-01
modified: 2017-12-11T14:58:43+02:00
broader: luuttusoittimet
definition: Pyöreäpohjainen, kaksoiskielin varustettu näppäilysoitin.
in scheme: ysa

luuttusoittimet
type: Concept
narrower: luuttu

89 Musiikki
type: Collection
member: luuttu