Преподавание и подготовка кадров
label: Enseignement et formation @fr
label: Enseñanza y formación @es
label: Teaching and training @en
notation: 1.60
type: ConceptGroup
member: Учебные семинары (метод преподавания)

Тезаурус ЮНЕСКО
preferred label: Thésaurus de l'UNESCO @fr
preferred label: Tesauro de la UNESCO @es
preferred label: UNESCO Thesaurus @en
type: ConceptScheme

Учебные семинары (метод преподавания)
preferred label: Taller (método pedagógico) @es
preferred label: Workshops (teaching method) @en
preferred label: Atelier (méthode pédagogique) @fr
scope note: Réunion d'individus, généralement des experts, partageant les mêmes intérêts et les mêmes problèmes, pour favoriser les échanges d'information et acquérir des habiletés et des techniques utiles. @fr
scope note: Встречи лиц, объединенных общими интересами и проблемами, с экспертами в целях обмена информацией и обучения необходимым навыкам или приемам.
scope note: Reuniones de individuos, generalmente expertos, con intereses y problemas comunes, para intercambiar información y adquirir habilidades y técnicas útiles. @es
type: Concept
in scheme: Тезаурус ЮНЕСКО
broader: Групповое обучение
member of: Преподавание и подготовка кадров

Групповое обучение
preferred label: Enseñanza en grupo @es
preferred label: Enseignement de groupe @fr
preferred label: Group instruction @en
type: Concept
narrower: Учебные семинары (метод преподавания)