Thésaurus de l'UNESCO
preferred label: Тезаурус ЮНЕСКО @ru
preferred label: Tesauro de la UNESCO @es
preferred label: UNESCO Thesaurus @en
type: ConceptScheme

Eau de surface
preferred label: Поверхностные воды @ru
preferred label: Agua superficial @es
preferred label: Surface water @en
type: Concept
related: Bilan hydrique

Hydrologie
member: Bilan hydrique
preferred label: Hidrología @es
preferred label: Hydrology @en
preferred label: Гидрология @ru
notation: 2.50
type: ConceptGroup

Hydrologie
preferred label: Гидрология @ru
preferred label: Hidrología @es
preferred label: Hydrology @en
type: Concept
related: Bilan hydrique

Bilan hydrique
alternative label: Equilibrio hidrológico @es
alternative label: Bilan hydrologique
alternative label: Bilan d'eau
alternative label: Régime hydrique
in scheme: Thésaurus de l'UNESCO
preferred label: Equilibrio hídrico @es
preferred label: Водный баланс @ru
preferred label: Water balance @en
related: Hydrologie
related: Régime des eaux
related: Eau de surface
member of: Hydrologie
scope note: Поток и хранение в гидрологической единице, как, например, дренажный бассейн, почвенная зона, озеро или водохранилище, и взаимоотношения между испарением, осадками, стоком и изменением уровня запасов воды. @ru
scope note: Caudal y almacenamiento de agua en una unidad hidrológica (cuenca de drenaje, zona pedológica, lago o presa) y relación entre la evaporación, la precipitación, el desagüe y el cambio de nivel en esta unidad. @es
scope note: Le débit et le stockage d'eau dans une unité hydrologique telle qu'un bassin de drainage, une zone pédologique, un lac ou un réservoir, et le rapport entre l'évaporation, la précipitation, l'écoulement et le changement au niveau de la réserve d'eau.
broader: Ressources en eau
type: Concept

Régime des eaux
preferred label: Режим вод @ru
preferred label: Régimen de las aguas @es
preferred label: Regime of waters @en
type: Concept
related: Bilan hydrique

Ressources en eau
preferred label: Водные ресурсы @ru
preferred label: Recursos hídricos @es
preferred label: Water resources @en
type: Concept
narrower: Bilan hydrique