Thésaurus de l'UNESCO
preferred label: Тезаурус ЮНЕСКО @ru
preferred label: Tesauro de la UNESCO @es
preferred label: UNESCO Thesaurus @en
type: ConceptScheme

Programme des cours (fascicules)
preferred label: Рекомендации по составлению учебных планов @ru
preferred label: Guía de estudios @es
preferred label: Curriculum guides @en
type: Concept
related: Plan de leçon

Plan de leçon
member of: Installations et ressources éducatives
preferred label: Планы уроков @ru
preferred label: Plan de clase @es
preferred label: Lesson plans @en
alternative label: Lesson notes @en
alternative label: Plan de cours
alternative label: Записи во время уроков @ru
alternative label: Plan de la sesión @es
alternative label: Programa de la sesión @es
alternative label: Notes de cours
related: Programme des cours (fascicules)
related: Technique de la classe
in scheme: Thésaurus de l'UNESCO
type: Concept
broader: Livre de l'enseignant
scope note: Résumé de la matière qu'un enseignant souhaite couvrir avec ses étudiants au cours d'une leçon définie. Il peut s'agir d'une liste d'objectifs à atteindre, des principaux sujets à enseigner, des médias et ressources à utiliser, des méthodes d'enseignement et d'évaluation, etc.
scope note: Resumen de la materia que un profesor desea cubrir en una clase determinada. Puede ser la lista de objetivos a lograr, los temas principales, los medios y recursos a emplear, los métodos de enseñanza y de evaluación, etc. @es
scope note: Учительский проект задания, которое он намеревался выполнить в ходе конкретного урока. Может включать цели, ключевую учебную информацию, используемые учебные средства и технику, учебные приемы и методы оценки и т.д. @ru

Technique de la classe
preferred label: Приемы организации учебного процесса в классе @ru
preferred label: Técnica didáctica @es
preferred label: Classroom techniques @en
type: Concept
related: Plan de leçon

Installations et ressources éducatives
label: Instalaciones y recursos educativos @en
label: Материально-техническая база сферы образования @ru
label: Educational facilities @en
type: ConceptGroup
notation: 1.70
member: Plan de leçon

Livre de l'enseignant
preferred label: Педагогические методические руководства @ru
preferred label: Manual del profesor @es
preferred label: Teaching guides @en
type: Concept
narrower: Plan de leçon