Эволюция
preferred label: Evolución @es
preferred label: Évolution @fr
preferred label: Evolution @en
type: Concept
narrower: Биогенез

Биогенез
scope note: Teoría según la cual todo ser vivo puede surgir solamente de otro ser vivo. @es
scope note: Теория, в соответствии с которой живые организмы могут образоваться только из других живых организмов и никогда - из неживой материи.
scope note: Théorie d'après laquelle tout être vivant est issu d'un autre être vivant. @fr
preferred label: Biogenesis @en
preferred label: Biogénesis @es
preferred label: Biogenèse @fr
member of: Биология
in scheme: Тезаурус ЮНЕСКО
type: Concept
broader: Эволюция

Биология
type: ConceptGroup
label: Biología @es
label: Biologie @fr
label: Biology @en
notation: 2.70
member: Биогенез

Тезаурус ЮНЕСКО
preferred label: Thésaurus de l'UNESCO @fr
preferred label: Tesauro de la UNESCO @es
preferred label: UNESCO Thesaurus @en
type: ConceptScheme