Thésaurus de l'UNESCO
preferred label: Тезаурус ЮНЕСКО @ru
preferred label: Tesauro de la UNESCO @es
preferred label: UNESCO Thesaurus @en
type: ConceptScheme

Recherche agricole
scope note: Предназначены улучшить сорта зерновых культур, повысить урожайность, выработать устойчивость к болезням. @ru
scope note: Designed to improve crops, increase yields, develop resistances to diseases. @en
scope note: Investigación destinada a mejorar las cosechas, aumentar el rendimiento y desarrollar la resistencia a las enfermedades. @es
scope note: Destinée à améliorer les récoltes, accroître le rendement, développer la résistance aux maladies.
alternative label: Investigación agronómica @es
alternative label: Recherche agronomique
member of: Agriculture
preferred label: Исследования в области сельского хозяйства @ru
preferred label: Agricultural research @en
preferred label: Investigación agrícola @es
broader: Agriculture
in scheme: Thésaurus de l'UNESCO
type: Concept

Agriculture
preferred label: Сельское хозяйство @ru
preferred label: Agricultura @es
type: Concept
narrower: Recherche agricole

Agriculture
preferred label: Agricultura @es
preferred label: Сельское хозяйство @ru
notation: 6.35
type: ConceptGroup
member: Recherche agricole