Educational planning
preferred label: Planification de l'éducation @fr
preferred label: Планирование в области образования @ru
preferred label: Planificación de la educación @es
type: ConceptGroup
member: Adult education programmes
notation: 1.15

Adult education programmes
scope note: Программы, обеспечивающие возможность получить образование взрослым, не получившим достаточного официального образования, а также лицам, заинтересованным в обучении в течение всей жизни. @ru
scope note: Programmes designed to provide learning opportunities for both adults who have not had adequate formal education, as well as others interested in lifelong learning.
scope note: Programas destinados a proporcionar posibilidades de formación a los adultos que no han recibido una educación formal adecuada y a los que se interesan por una educación permanente. @es
scope note: Programme conçu pour fournir aux adultes qui n'ont pas reçu une éducation formelle adéquate, tout comme à ceux qui s'intéressent à l'éducation permanente, des possibilités de formation. @fr
preferred label: Programas educativos de adultos @es
preferred label: Образовательные программы для взрослого населения @ru
preferred label: Programme d'éducation des adultes @fr
type: Concept
broader: Educational programmes
in scheme: UNESCO Thesaurus
member of: Educational planning

UNESCO Thesaurus
preferred label: Тезаурус ЮНЕСКО @ru
preferred label: Thésaurus de l'UNESCO @fr
preferred label: Tesauro de la UNESCO @es
type: ConceptScheme

Educational programmes
preferred label: Образовательные программы @ru
preferred label: Programas de educación @es
preferred label: Programme d'éducation @fr
type: Concept
narrower: Adult education programmes