Citation
type: Concept
scope note: Note de référence à un ouvrage dont on cite un passage entre guillements ou à un matériel source quelconque faisant autorité, présentée pour appuyer une affirmation ou une proposition.
scope note: Справочная ссылка к работе, из которой цитируется фраза, или к источнику в качестве подтверждения тезиса или предположения. @ru
scope note: Nota de referencia a una obra de la que se cita un pasaje entre comillas, o material fiable presentado para apoyar una afirmación o una proposición. @es
preferred label: Cita @es
preferred label: Quotations @en
preferred label: Цитаты @ru
broader: Document secondaire
alternative label: Extrait
alternative label: Extracto @es
alternative label: Excerpts @en
alternative label: Выдержки из текста @ru
in scheme: Thésaurus de l'UNESCO
member of: Sources d'information

Document secondaire
type: Concept
preferred label: Вторичные документы @ru
preferred label: Documento secundario @es
preferred label: Secondary documents @en
narrower: Citation

Thésaurus de l'UNESCO
type: ConceptScheme
preferred label: Тезаурус ЮНЕСКО @ru
preferred label: Tesauro de la UNESCO @es
preferred label: UNESCO Thesaurus @en

Sources d'information
type: ConceptGroup
preferred label: Information sources @en
preferred label: Fuentes de información @es
preferred label: Информационные источники @ru
member: Citation
notation: 5.30