Торговый баланс
type: Concept
preferred label: Balanza comercial @es
preferred label: Balance commerciale @fr
preferred label: Balance of trade @en
related: Условия торговли

Цены на товары
type: Concept
preferred label: Precio de productos básicos @es
preferred label: Prix des produits de base @fr
preferred label: Commodity prices @en
related: Условия торговли

Экспорт/импорт
type: Concept
preferred label: Exportación/importación @es
preferred label: Exportation/importation @fr
preferred label: Exports/imports @en
related: Условия торговли

Международная торговля
type: Concept
narrower: Условия торговли
preferred label: Comercio internacional @es
preferred label: Commerce international @fr
preferred label: International trade @en

Условия торговли
type: Concept
member of: Финансы и торговля
broader: Международная торговля
in scheme: Тезаурус ЮНЕСКО
preferred label: Terms of trade @en
preferred label: Relación de intercambio @es
preferred label: Termes de l'échange @fr
related: Цены на товары
related: Экспорт/импорт
related: Торговый баланс
scope note: Rapport entre les prix à l'export et les prix à l'import des produits lancés dans le commerce international d'un pays ou d'une région donnée. Peut aussi, par extension, être utilisé en rapport avec le commerce entre régions d'un même pays, tels que les régions urbaines ou rurales. @fr
scope note: Relación entre los precios de las exportaciones y de las importaciones de los productos de un país o de una región que participan del comercio internacional. Por extensión, puede utilizarse también para referirse al comercio entre zonas de un mismo país, tales como las regiones urbanas o rurales. @es
scope note: Соотношение экспортных и импортных цен на товары, находящиеся во внешнеторговом обороте страны или региона. Может также использоваться в более широком смысле в отношении торгового оборота между регионами в пределах одной страны, например, между городскими и сельскими районами.

Финансы и торговля
type: ConceptGroup
label: Finanzas y comercio @es
label: Finance and trade @en
label: Finances et commerce @fr
member: Условия торговли
notation: 6.70

Тезаурус ЮНЕСКО
type: ConceptScheme
preferred label: Thésaurus de l'UNESCO @fr
preferred label: Tesauro de la UNESCO @es
preferred label: UNESCO Thesaurus @en