Serbio
type: Concept
member of: Lenguas
broader: Lengua eslava
in scheme: Tesauro de la UNESCO
preferred label: Serbian @en
preferred label: Serbe @fr
preferred label: Сербский язык @ru
scope note: Utiliser pour les ouvrages traitant de la langue propre aux serbes. Pour les ouvrages traitant de la langue des serbes, des croates et des bosniaques en tant qu'entité, utiliser "serbocroate". @fr
scope note: Utilizar para las obras sobre la lengua propia de los serbios. Para las obras sobre la lengua de los serbios, los croatas o los bosnios como entidad, utilizar "serbocroata".
scope note: Используется по отношению к работам на языке сербов, рассматривающемся в качестве самостоятельного языка. По отношению к работам на языке сербов, хорватов и боснийцев, являющемся общим для этих народов, используйте термин "Сербскохорватский язык". @ru

Lengua eslava
type: Concept
narrower: Serbio
preferred label: Славянские языки @ru
preferred label: Langue slave @fr
preferred label: Slavic languages @en

Lenguas
type: ConceptGroup
label: Langues @fr
label: Языки @ru
label: Languages @en
member: Serbio
notation: 3.35

Tesauro de la UNESCO
type: ConceptScheme
preferred label: Тезаурус ЮНЕСКО @ru
preferred label: Thésaurus de l'UNESCO @fr
preferred label: UNESCO Thesaurus @en