Климатические зоны
type: Concept
preferred label: Zona climática @es
preferred label: Zone climatique @fr
preferred label: Climatic zones @en
related: Региональная география

География
type: Concept
narrower: Региональная география
preferred label: Geografía @es
preferred label: Géographie @fr
preferred label: Geography @en

Региональная география
type: Concept
member of: География и океанография
alternative label: Area studies @en
alternative label: Étude régionale @fr
alternative label: Изучение районов
broader: География
in scheme: Тезаурус ЮНЕСКО
preferred label: Géographie régionale @fr
preferred label: Geografía regional @es
preferred label: Regional geography @en
related: Климатические зоны
scope note: Utilizar para referirse al estudio de las características geográficas de una región y la forma de la que interactúan para dar a la región su caracter particular. @es
scope note: Utiliser pour désigner l'étude des caractéristiques géographiques d'une région, et comment celles-ci interagissent pour donner à la région son caractère particulier. @fr
scope note: Используется по отношению к изучению географических особенностей конкретного района, их взаимодействия и придания этому району уникального характера.

География и океанография
type: ConceptGroup
label: Geography and oceanography @en
label: Géographie et océanographie @fr
label: Geografía y oceanografía @es
member: Региональная география
notation: 2.40

Тезаурус ЮНЕСКО
type: ConceptScheme
preferred label: Thésaurus de l'UNESCO @fr
preferred label: Tesauro de la UNESCO @es
preferred label: UNESCO Thesaurus @en