Групповые дискуссии
type: Concept
preferred label: Debate en grupo @es
preferred label: Discussion de groupe @fr
preferred label: Group discussions @en
related: Группы качества и рационализации

Управленческие операции
type: Concept
narrower: Группы качества и рационализации
preferred label: Operación administrativa @es
preferred label: Opération de gestion @fr
preferred label: Management operations @en

Группы качества и рационализации
type: Concept
member of: Организация и управление
broader: Управленческие операции
in scheme: Тезаурус ЮНЕСКО
preferred label: Cercle de qualité @fr
preferred label: Círculo de calidad @es
preferred label: Quality circles @en
related: Участие трудящихся
related: Групповые дискуссии
scope note: Grupo de trabajadores que efectua un trabajo similar, preparados para identificar y resolver problemas, y dispuestos a efectuar recomendaciones sobre la mejora del producto, la calidad, el ánimo de los trabajadores, etc. @es
scope note: Группы работников схожих специальностей, созданные для выявления и решения производственных проблем и добровольно вырабатывающие рекомендации по повышению производительности, качества, улучшению рабочей обстановки и пр.
scope note: Groupe de travailleurs, effectuant un travail similaire et entraînés à identifier et résoudre les problèmes, qui se porte volontaire pour faire des recommendations concernant l'amélioration de la productivité, de la qualité, de l'état d'esprit des travailleurs, etc. @fr

Участие трудящихся
type: Concept
preferred label: Participación de los trabajadores @es
preferred label: Participation des travailleurs @fr
preferred label: Workers participation @en
related: Группы качества и рационализации

Организация и управление
type: ConceptGroup
label: Administration et gestion @fr
label: Organización y gestión @es
label: Organization and management @en
member: Группы качества и рационализации
notation: 6.75

Тезаурус ЮНЕСКО
type: ConceptScheme
preferred label: Thésaurus de l'UNESCO @fr
preferred label: Tesauro de la UNESCO @es
preferred label: UNESCO Thesaurus @en