Iran
type: Concept
member of: Asie et Pacifique
broader: Moyen-Orient
in scheme: Thésaurus de l'UNESCO
preferred label: Иран @ru
preferred label: Irán @es
scope note: Используется по отношению к событиям, происходившим до 1979 г.; в иных случаях - Исламская Республика Иран. @ru
scope note: Se aplica a los eventos anteriores a 1979. En caso contrario emplear Irán, República Islámica. @es
scope note: Utiliser pour les événements survenus avant 1979. Autrement, utiliser Iran, République islamique.

Moyen-Orient
type: Concept
narrower: Iran
preferred label: Средний Восток @ru
preferred label: Oriente Medio @es
preferred label: Middle East @en

Asie et Pacifique
type: ConceptGroup
label: Asia y Pacífico @es
label: Asia and the Pacific @en
label: Азия и регион Тихого океана @ru
member: Iran
notation: 7.15

Thésaurus de l'UNESCO
type: ConceptScheme
preferred label: Тезаурус ЮНЕСКО @ru
preferred label: Tesauro de la UNESCO @es
preferred label: UNESCO Thesaurus @en