Дополнительное образование
type: Concept
preferred label: Educación complementaria @es
preferred label: Éducation périscolaire @fr
preferred label: Extension education @en
related: Домашние занятия

Домашние занятия
type: Concept
member of: Преподавание и подготовка кадров
broader: Учебные методы
in scheme: Тезаурус ЮНЕСКО
preferred label: Home study @en
preferred label: Études à domicile @fr
preferred label: Estudio en casa @es
related: Дополнительное образование
related: Самостоятельное обучение
scope note: Etudes effectuées à la maison en dehors des horaires scolaires; comprend les devoirs exigés par l'école, les projets communautaires, ou un travail entrepris pour surmonter des difficultés individuelles. @fr
scope note: Занятия, осуществляемые дома во внеучебное время, включая работу над домашними заданиями, в рамках общественных проектов или для решения индивидуальных задач.
scope note: Estudio efectuado en casa fuera de las horas de clase incluidos los deberes exigidos por el colegio, los proyectos comunitarios y las tareas llevadas a cabo para superar problemas individuales. @es

Самостоятельное обучение
type: Concept
preferred label: Estudios por libre @es
preferred label: Études libres @fr
preferred label: Independent study @en
related: Домашние занятия

Учебные методы
type: Concept
narrower: Домашние занятия
preferred label: Método de aprendizaje @es
preferred label: Méthode d'apprentissage @fr
preferred label: Learning methods @en

Преподавание и подготовка кадров
type: ConceptGroup
label: Enseignement et formation @fr
label: Enseñanza y formación @es
label: Teaching and training @en
member: Домашние занятия
notation: 1.60

Тезаурус ЮНЕСКО
type: ConceptScheme
preferred label: Thésaurus de l'UNESCO @fr
preferred label: Tesauro de la UNESCO @es
preferred label: UNESCO Thesaurus @en