Словари
type: Concept
narrower: Глоссарии
preferred label: Diccionario @es
preferred label: Dictionnaire @fr
preferred label: Dictionaries @en

Глоссарии
type: Concept
member of: Информационные источники
broader: Словари
in scheme: Тезаурус ЮНЕСКО
preferred label: Glossaire @fr
preferred label: Glossaries @en
preferred label: Glosario @es
scope note: Словарь, содержащий толкования или объяснения терминов, составленный не обязательно в алфавитном порядке.
scope note: Lexique dont les mots ne sont pas nécessairement classés par ordre alphabétique, donnant la définition et l'explication de chacun des termes. @fr
scope note: Léxico cuyas palabras no están necesariamente ordenadas por orden alfabético y que incluye la definición y explicación de cada uno de sus términos. @es

Информационные источники
type: ConceptGroup
label: Information sources @en
label: Sources d'information @fr
label: Fuentes de información @es
member: Глоссарии
notation: 5.30

Тезаурус ЮНЕСКО
type: ConceptScheme
preferred label: Thésaurus de l'UNESCO @fr
preferred label: Tesauro de la UNESCO @es
preferred label: UNESCO Thesaurus @en