Методы оценки
type: Concept
narrower: Формативная оценка
preferred label: Método de evaluación @es
preferred label: Méthode d'évaluation @fr
preferred label: Evaluation methods @en

Формативная оценка
type: Concept
member of: Научный подход
broader: Методы оценки
in scheme: Тезаурус ЮНЕСКО
preferred label: Formative evaluation @en
preferred label: Évaluation formative @fr
preferred label: Evaluación formativa @es
related: Суммативная оценка
scope note: Tipo de valoración destinada a la modificación y mejora de productos, programas o actividades durante su planificación y desarrollo. @es
scope note: Type d'évaluation destinée essentiellement à modifier et à améliorer un produit, un programme ou une activité en cours de planification et de développement. @fr
scope note: Данный метод оценки в основном применяется на стадии планирования или разработки в целях модификации и улучшения конечных продуктов, программ или деятельности.

Суммативная оценка
type: Concept
preferred label: Evaluación sumativa @es
preferred label: Évaluation sommative @fr
preferred label: Summative evaluation @en
related: Формативная оценка

Научный подход
type: ConceptGroup
label: Scientific approach @en
label: Approche scientifique @fr
label: Enfoque científico @es
member: Формативная оценка
notation: 2.05

Тезаурус ЮНЕСКО
type: ConceptScheme
preferred label: Thésaurus de l'UNESCO @fr
preferred label: Tesauro de la UNESCO @es
preferred label: UNESCO Thesaurus @en