Gobierno electrónico
type: Concept
member of: Política y gobierno
alternative label: Online governance @en
alternative label: Государственное управление в режиме реального времени @ru
alternative label: Cibergobierno
alternative label: Gouvernance en ligne @fr
alternative label: Gobierno en línea
alternative label: E-governance @en
alternative label: Э-управление @ru
alternative label: E-gouvernance @fr
alternative label: Administration en ligne @fr
broader: Gobernabilidad
in scheme: Tesauro de la UNESCO
preferred label: Cybergouvernance @fr
preferred label: Electronic governance @en
preferred label: Электронное управление @ru
related: Participación política
related: Información pública
related: Tecnología de la información
related: Internet
scope note: Empleo, por parte del sector público, de tecnologías de la información y de la comunicación con el objetivo de facilitar la difusión de la información, ofrecer determinados servicios, alentar al ciudadano a que participe en el proceso de toma de decisiones y hacer el gobierno más responsable, transparente y eficaz.
scope note: Использование информационных и коммуникационных технологий в государственном секторе с целью улучшения информационного сервиса, поощрения участия граждан в процессе принятия решений и придания работе правительства большей степени отчетности, прозрачности и эффективности. @ru
scope note: Utilisation par le secteur public des technologies de l'information et de la communication dans le but de faciliter la diffusion de l'information et les prestations de services, d'encourager la participation du citoyen au processus décisionnel et de rendre le gouvernement plus responsable, plus transparent et plus efficace. @fr

Gobernabilidad
type: Concept
narrower: Gobierno electrónico
preferred label: Властное управление @ru
preferred label: Gouvernance @fr
preferred label: Governance @en

Tecnología de la información
type: Concept
preferred label: Информационная технология @ru
preferred label: Technologie de l'information @fr
preferred label: Information technology @en
related: Gobierno electrónico

Internet
type: Concept
related: Gobierno electrónico

Participación política
type: Concept
preferred label: Политическое участие @ru
preferred label: Participation politique @fr
preferred label: Political participation @en
related: Gobierno electrónico

Información pública
type: Concept
preferred label: Общественная информация @ru
preferred label: Information grand public @fr
preferred label: Public information @en
related: Gobierno electrónico

Política y gobierno
type: ConceptGroup
label: Politique et gouvernement @fr
label: Политика и государство @ru
label: Politics and government @en
member: Gobierno electrónico
notation: 6.15

Tesauro de la UNESCO
type: ConceptScheme
preferred label: Тезаурус ЮНЕСКО @ru
preferred label: Thésaurus de l'UNESCO @fr
preferred label: UNESCO Thesaurus @en