Éducation
type: Concept
main concept of: Sciences de l'éducation et milieu éducatif
member of: Sciences de l'éducation et milieu éducatif
in scheme: Thésaurus de l'UNESCO
preferred label: Educación @es
preferred label: Образование @ru
preferred label: Education @en
related: Profession d'enseignant
related: Apprentissage
scope note: Proceso por el cual uno desarrolla habilidades, actitudes y otras formas de comportamiento valoradas por la sociedad en la que vive. Utilizar un descriptor más preciso. @es
scope note: Процесс, способствующий развитию способностей, отношений и других форм поведения, воспринимаемых обществом как достоинство. В необходимых случаях используйте более точный дескриптор. @ru
scope note: Mise en oeuvre de moyens par lesquels l'on développe des capacités, des attitudes et autres formes de comportements valorisés par la société dans laquelle on vit. Utiliser un descripteur plus précis.
top concept of: Thésaurus de l'UNESCO

Apprentissage
type: Concept
preferred label: Учеба (процесс) @ru
preferred label: Aprendizaje @es
preferred label: Learning @en
related: Éducation

Profession d'enseignant
type: Concept
preferred label: Педагогическая профессия @ru
preferred label: Docencia @es
preferred label: Teaching profession @en
related: Éducation

Sciences de l'éducation et milieu éducatif
type: ConceptGroup
has main concept: Éducation
label: Educational sciences and environment @en
label: Образовательные науки и охрана окружающей среды @ru
label: Ciencias de la educación y ambiente educacional @es
member: Éducation
notation: 1.05

Thésaurus de l'UNESCO
type: ConceptScheme
has top concept: Éducation
preferred label: Тезаурус ЮНЕСКО @ru
preferred label: Tesauro de la UNESCO @es
preferred label: UNESCO Thesaurus @en