Répertoire
type: Concept
member of: Sources d'information
broader: Document secondaire
in scheme: Thésaurus de l'UNESCO
narrower: Guide aux sources d'information
preferred label: Directories @en
preferred label: Адресные справочники @ru
preferred label: Directorio @es
related: Ouvrage de référence
scope note: Liste de personnes ou d'organismes présentés de manière systématique ou par ordre alphabétique, fournissant des informations sur chacun des éléments inclus, habituellement au moins l'adresse.
scope note: Перечни лиц или организаций, систематизированные по алфавиту или иному признаку и предоставляющие определенную информацию по каждому элементу, обычно как минимум адрес. @ru
scope note: Lista de personas o de organismos presentados de manera sistemática o por orden alfabético que incluye informaciones de cada una de las unidades. Habitualmente incluye al menos la dirección. @es

Guide aux sources d'information
type: Concept
broader: Répertoire
preferred label: Указатели по источникам информации @ru
preferred label: Guía de fuentes de información @es
preferred label: Guides to information sources @en

Ouvrage de référence
type: Concept
preferred label: Справочные материалы @ru
preferred label: Material de referencia @es
preferred label: Reference materials @en
related: Répertoire

Document secondaire
type: Concept
narrower: Répertoire
preferred label: Вторичные документы @ru
preferred label: Documento secundario @es
preferred label: Secondary documents @en

Sources d'information
type: ConceptGroup
label: Information sources @en
label: Fuentes de información @es
label: Информационные источники @ru
member: Répertoire
notation: 5.30

Thésaurus de l'UNESCO
type: ConceptScheme
preferred label: Тезаурус ЮНЕСКО @ru
preferred label: Tesauro de la UNESCO @es
preferred label: UNESCO Thesaurus @en