Cours par unités capitalisables
type: Concept
member of: Programmes d'études
alternative label: Cours à unités
broader: Cours d'enseignement
in scheme: Thésaurus de l'UNESCO
preferred label: Credit courses @en
preferred label: Зачетные курсы @ru
preferred label: Curso con créditos @es
scope note: Cours, au niveau de l'enseignement supérieur, mesuré par un système d'unités et selon lequel des unités sont attribuées à un cours en fonction du nombre d'heures d'enseignement par semaine et du nombre de semaines dans la session.
scope note: Curso de enseñanza superior medido por un sistema de unidades según el cual a cada asignatura le corresponden más o menos unidades en función del número de horas lectivas. @es
scope note: Отражает объем работы над каждым курсом высшего учебного заведения, измеряемой системой кредитов (зачетных единиц), определяемой количеством часов в неделю и количеством недель в семестре. @ru

Cours d'enseignement
type: Concept
narrower: Cours par unités capitalisables
preferred label: Учебные курсы @ru
preferred label: Curso de enseñanza @es
preferred label: Educational courses @en

Programmes d'études
type: ConceptGroup
label: Учебный план @ru
label: Planes de estudios @es
label: Curriculum @en
member: Cours par unités capitalisables
notation: 1.40

Thésaurus de l'UNESCO
type: ConceptScheme
preferred label: Тезаурус ЮНЕСКО @ru
preferred label: Tesauro de la UNESCO @es
preferred label: UNESCO Thesaurus @en