Коллективные договоры
type: Concept
broader: Согласование коллективных договоров
preferred label: Convenio colectivo @es
preferred label: Convention collective @fr
preferred label: Collective agreements @en

Согласование коллективных договоров
type: Concept
member of: Труд
broader: Профсоюзы
in scheme: Тезаурус ЮНЕСКО
narrower: Коллективные договоры
preferred label: Collective bargaining @en
preferred label: Négociation collective @fr
preferred label: Negociación colectiva @es
related: Трудовые нормативы
related: Трудовые споры
scope note: Conversaciones en las que los representantes de los trabajadores y los patronos analizan los diversos aspectos de su relación con el fin de llegar a un acuerdo de trabajo satisfactorio para las dos partes. @es
scope note: Процесс, в ходе которого представители работодателя и работников обсуждают и согласовывают различные стороны двусторонних взаимоотношений с целью выработки взаимоприемлемого трудового договора.
scope note: Pourparlers au cours desquels les représentants d'employeurs et d'employés traitent et débattent des différents aspects de leur relation, afin de parvenir à un accord de travail satisfaisant pour les deux parties. @fr

Трудовые споры
type: Concept
preferred label: Conflicto laboral @es
preferred label: Conflit du travail @fr
preferred label: Labour disputes @en
related: Согласование коллективных договоров

Трудовые нормативы
type: Concept
preferred label: Norma de trabajo @es
preferred label: Norme de travail @fr
preferred label: Labour standards @en
related: Согласование коллективных договоров

Профсоюзы
type: Concept
narrower: Согласование коллективных договоров
preferred label: Sindicato @es
preferred label: Syndicat @fr
preferred label: Trade unions @en

Труд
type: ConceptGroup
label: Trabajo @es
label: Labour @en
label: Travail @fr
member: Согласование коллективных договоров
notation: 6.85

Тезаурус ЮНЕСКО
type: ConceptScheme
preferred label: Thésaurus de l'UNESCO @fr
preferred label: Tesauro de la UNESCO @es
preferred label: UNESCO Thesaurus @en