Белорусская ССР
type: Concept
member of: Европа
broader: СССР
in scheme: Тезаурус ЮНЕСКО
preferred label: RSS de Bielorrusia @es
preferred label: Byelorussian SSR @en
preferred label: RSS de Biélorussie @fr
scope note: Используется по отношению к событиям, происходившим до 1991 г.; в иных случаях используйте термин "Беларусь".
scope note: Se aplica a los eventos anteriores a 1991. En caso contrario, utilizar "Belarrús". @es
scope note: S'applique aux événements survenus avant 1991; utiliser autrement "Bélarus". @fr

СССР
type: Concept
narrower: Белорусская ССР
preferred label: URSS @es
preferred label: USSR @en

Европа
type: ConceptGroup
label: Europa @es
label: Europe @fr
member: Белорусская ССР
notation: 7.20

Тезаурус ЮНЕСКО
type: ConceptScheme
preferred label: Thésaurus de l'UNESCO @fr
preferred label: Tesauro de la UNESCO @es
preferred label: UNESCO Thesaurus @en